Reaction Details
Target72 kDa type IV collagenase
LigandBDBM50097262
Substrate/Competitorn/a
Meas. Tech.ChEBML_106807
IC50 100±n/a nM
Citation Fray, MJDickinson, RP Discovery of potent and selective succinyl hydroxamate inhibitors of matrix metalloprotease-3 (stromelysin-1). Bioorg Med Chem Lett11:571-4 (2001) 72 kDa type IV collagenase
Name:72 kDa type IV collagenase
Type:Enzyme
Mol. Mass.:73870.36
Organism:Homo sapiens (Human)
Description: P08253
Residue:660
BDBM50097262
NameBDBM50097262
Synonyms:(R)-N*1*-[(S)-2,2-Dimethyl-1-((R)-1-phenyl-ethylcarbamoyl)-propyl]-N*4*-hydroxy-2-nonyl-succinamide CHEMBL347673
TypeSmall organic molecule
Emp. Form.C27H45N3O4
Mol. Mass.475.6639
SMILESCCCCCCCCC[C@H](CC(=O)NO)C(=O)N[C@H](C(=O)N[C@H](C)c1ccccc1)C(C)(C)C