Reaction Details
TargetProstaglandin G/H synthase 2
LigandBDBM50022309
Substrate/Competitorn/a
Meas. Tech.ChEMBL_217832 (CHEMBL822752)
IC50 3790±n/a nM
Citation Meinke, PT Perspectives in animal health: old targets and new opportunities. J Med Chem44:641-59 (2001) Prostaglandin G/H synthase 2
Name:Prostaglandin G/H synthase 2
Type:PROTEIN
Mol. Mass.:68982.35
Organism:Canis familiaris
Description:ChEMBL_344386
Residue:604
BDBM50022309
NameBDBM50022309
Synonyms:3,5-Dioxo-1,2-diphenyl-4-n-butylpyrazolidine 4-n-Butyl-1,2-diphenyl-3,5-pyrazolidinedione PHENYLBUTAZONE | Phenylbutazon
TypeSmall organic molecule
Emp. Form.C19H20N2O2
Mol. Mass.308.3743
SMILESCCCCc1c(O)n(-c2ccccc2)n(-c2ccccc2)c1=O