Reaction Details
TargetMu-type opioid receptor
LigandBDBM50083926
Substrate/Competitorn/a
Meas. Tech.ChEMBL_145299 (CHEMBL752834)
Ki 0.320000±n/a nM
Citation Wentland, MPLou, RYe, YCohen, DJRichardson, GPBidlack, JM 8-Carboxamidocyclazocine analogues: redefining the structure-activity relationships of 2,6-methano-3-benzazocines. Bioorg Med Chem Lett11:623-6 (2001) Mu-type opioid receptor
Name:Mu-type opioid receptor
Type:Enzyme Catalytic Domain
Mol. Mass.:11165.58
Organism:GUINEA PIG
Description:P97266
Residue:98
BDBM50083926
NameBDBM50083926
Synonyms:(6S,11R)-3-Cyclopropylmethyl-6,11-dimethyl-1,2,3,4,5,6-hexahydro-2,6-methano-benzo[d]azocin-8-ol (cyclazocine)2-{4-[(2,4-Diamino-pteridin-6-ylmethyl)-methyl-amino]-benzoylamino}-pentanedioic acid 3-Cyclopropylmethyl-6,11-dimethyl-1,2,3,4,5,6-hexahydro-2,6-methano-benzo[d]azocin-8-ol (cyclazocine) 3-Cyclopropylmethyl-8-hydroxy-6,11-dimethyl-1,2,3,4,5,6-hexahydro-2,6-methano-benzo[d]azocinium BDBM50451129 CYCLAZOCINE
TypeSmall organic molecule
Emp. Form.C18H25NO
Mol. Mass.271.3972
SMILESC[C@H]1[C@H]2Cc3ccc(O)cc3[C@@]1(C)CCN2CC1CC1