Reaction Details
TargetDelta-type opioid receptor
LigandBDBM50097579
Substrate/Competitorn/a
Meas. Tech.ChEBML_147167
Ki 8.3±n/a nM
Citation Wentland, MPLou, RYe, YCohen, DJRichardson, GPBidlack, JM 8-Carboxamidocyclazocine analogues: redefining the structure-activity relationships of 2,6-methano-3-benzazocines. Bioorg Med Chem Lett11:623-6 (2001) Delta-type opioid receptor
Name:Delta-type opioid receptor
Type:G Protein-Coupled Receptor (GPCR)
Mol. Mass.:40382.98
Organism:Homo sapiens (Human)
Description:Competition binding assays were carried out using membrane preparations from transfected HN9.10 cells that constitutively expressed the delta opioid receptor.
Residue:372
BDBM50097579
NameBDBM50097579
Synonyms:(6S,11R)-3-Cyclopropylmethyl-6,11-dimethyl-1,2,3,4,5,6-hexahydro-2,6-methano-benzo[d]azocine-8-carboxylic acid amide 8-carboxamidocyclazocine US9656961, Example 00157
TypeSmall organic molecule
Emp. Form.C19H26N2O
Mol. Mass.298.4225
SMILESC[C@H]1C2Cc3ccc(cc3[C@@]1(C)CCN2CC1CC1)C(N)=O