Reaction Details
TargetKappa-type opioid receptor
LigandBDBM50000091
Substrate/Competitorn/a
Meas. Tech.ChEBML_146666
Ki 0.620000±n/a nM
Citation Wentland, MPLou, RYe, YCohen, DJRichardson, GPBidlack, JM 8-Carboxamidocyclazocine analogues: redefining the structure-activity relationships of 2,6-methano-3-benzazocines. Bioorg Med Chem Lett11:623-6 (2001) Kappa-type opioid receptor
Name:Kappa-type opioid receptor
Type:G Protein-Coupled Receptor (GPCR)
Mol. Mass.:42744.99
Organism:Cavia porcellus (domestic guinea pig)
Description:P41144
Residue:380
BDBM50000091
NameBDBM50000091
Synonyms:(6S,11R)-3-Cyclopropylmethyl-6-ethyl-8-hydroxy-11-methyl-3,4,5,6-tetrahydro-2H-2,6-methano-benzo[d]azocin-1-one 3-Cyclopropylmethyl-6-ethyl-8-hydroxy-11-methyl-3,4,5,6-tetrahydro-2H-2,6-methano-benzo[d]azocin-1-one 3-Cyclopropylmethyl-6-ethyl-8-hydroxy-11-methyl-3,4,5,6-tetrahydro-2H-2,6-methano-benzo[d]azocin-1-one(Ethylketazocine, EKC) EKC | EKC(-)
TypeSmall organic molecule
Emp. Form.C19H25NO2
Mol. Mass.299.4073
SMILESCC[C@]12CCN(CC3CC3)C([C@@H]1C)C(=O)c1ccc(O)cc21