Reaction Details
TargetSerine protease 1
LigandBDBM50097754
Substrate/Competitorn/a
Meas. Tech.ChEBML_212728
Ki 540±n/a nM
Citation Jones, SDLiebeschuetz, JWMorgan, PJMurray, CWRimmer, ADRoscoe, JMWaszkowycz, BWelsh, PMWylie, WAYoung, SCMartin, HMahler, JBrady, LWilkinson, K The design of phenylglycine containing benzamidine carboxamides as potent and selective inhibitors of factor Xa. Bioorg Med Chem Lett11:733-6 (2001) Serine protease 1
Name:Serine protease 1
Type:Enzyme
Mol. Mass.:26557.80
Organism:Homo sapiens (Human)
Description:P07477
Residue:247
BDBM50097754
NameBDBM50097754
Synonyms:3-Carbamimidoyl-N-{(R)-2-[4-(4-fluoro-benzoyl)-piperidin-1-yl]-2-oxo-1-phenyl-ethyl}-benzamide | CHEMBL162634
TypeSmall organic molecule
Emp. Form.C28H27FN4O3
Mol. Mass.486.5374
SMILESNC(=N)c1cccc(c1)C(=O)N[C@@H](C(=O)N1CCC(CC1)C(=O)c1ccc(F)cc1)c1ccccc1