Reaction Details
TargetCoagulation factor X
LigandBDBM50097763
Substrate/Competitorn/a
Meas. Tech.ChEBML_69661
Ki 800±n/a nM
Citation Jones, SDLiebeschuetz, JWMorgan, PJMurray, CWRimmer, ADRoscoe, JMWaszkowycz, BWelsh, PMWylie, WAYoung, SCMartin, HMahler, JBrady, LWilkinson, K The design of phenylglycine containing benzamidine carboxamides as potent and selective inhibitors of factor Xa. Bioorg Med Chem Lett11:733-6 (2001) Coagulation factor X
Name:Coagulation factor X
Type:Enzyme
Mol. Mass.:54726.60
Organism:Homo sapiens (Human)
Description:n/a
Residue:488
BDBM50097763
NameBDBM50097763
Synonyms:CHEMBL159833 | N-{[(4-Aminomethyl-cyclohexylmethyl)-carbamoyl]-biphenyl-4-yl-methyl}-3-carbamimidoyl-benzamide
TypeSmall organic molecule
Emp. Form.C30H35N5O2
Mol. Mass.497.6312
SMILESNCC1CCC(CNC(=O)C(NC(=O)c2cccc(c2)C(N)=N)c2ccc(cc2)-c2ccccc2)CC1