Reaction Details
TargetSerine protease 1
LigandBDBM50097761
Substrate/Competitorn/a
Meas. Tech.ChEBML_212728
Ki 460±n/a nM
Citation Jones, SDLiebeschuetz, JWMorgan, PJMurray, CWRimmer, ADRoscoe, JMWaszkowycz, BWelsh, PMWylie, WAYoung, SCMartin, HMahler, JBrady, LWilkinson, K The design of phenylglycine containing benzamidine carboxamides as potent and selective inhibitors of factor Xa. Bioorg Med Chem Lett11:733-6 (2001) Serine protease 1
Name:Serine protease 1
Type:Enzyme
Mol. Mass.:26557.80
Organism:Homo sapiens (Human)
Description:P07477
Residue:247
BDBM50097761
NameBDBM50097761
Synonyms:CHEMBL350632 | N-[(R)-2-(4-Benzoyl-piperazin-1-yl)-2-oxo-1-phenyl-ethyl]-3-carbamimidoyl-benzamide
TypeSmall organic molecule
Emp. Form.C27H27N5O3
Mol. Mass.469.535
SMILESNC(=N)c1cccc(c1)C(=O)N[C@@H](C(=O)N1CCN(CC1)C(=O)c1ccccc1)c1ccccc1