Reaction Details
TargetCoagulation factor X
LigandBDBM50097765
Substrate/Competitorn/a
Meas. Tech.ChEBML_69661
Ki 300±n/a nM
Citation Jones, SDLiebeschuetz, JWMorgan, PJMurray, CWRimmer, ADRoscoe, JMWaszkowycz, BWelsh, PMWylie, WAYoung, SCMartin, HMahler, JBrady, LWilkinson, K The design of phenylglycine containing benzamidine carboxamides as potent and selective inhibitors of factor Xa. Bioorg Med Chem Lett11:733-6 (2001) Coagulation factor X
Name:Coagulation factor X
Type:Enzyme
Mol. Mass.:54726.60
Organism:Homo sapiens (Human)
Description:n/a
Residue:488
BDBM50097765
NameBDBM50097765
Synonyms:CHEMBL162635 | N-{[(4-Aminomethyl-cyclohexylmethyl)-carbamoyl]-phenyl-methyl}-3-carbamimidoyl-benzamide
TypeSmall organic molecule
Emp. Form.C24H31N5O2
Mol. Mass.421.5352
SMILESNCC1CCC(CNC(=O)C(NC(=O)c2cccc(c2)C(N)=N)c2ccccc2)CC1