Reaction Details
TargetCoagulation factor X
LigandBDBM50097770
Substrate/Competitorn/a
Meas. Tech.ChEBML_69661
Ki 15±n/a nM
Citation Jones, SDLiebeschuetz, JWMorgan, PJMurray, CWRimmer, ADRoscoe, JMWaszkowycz, BWelsh, PMWylie, WAYoung, SCMartin, HMahler, JBrady, LWilkinson, K The design of phenylglycine containing benzamidine carboxamides as potent and selective inhibitors of factor Xa. Bioorg Med Chem Lett11:733-6 (2001) Coagulation factor X
Name:Coagulation factor X
Type:Enzyme
Mol. Mass.:54726.60
Organism:Homo sapiens (Human)
Description:n/a
Residue:488
BDBM50097770
NameBDBM50097770
Synonyms:3-Carbamimidoyl-N-{(R)-2-[4-(4-fluoro-phenyl)-piperazin-1-yl]-2-oxo-1-phenyl-ethyl}-benzamide | CHEMBL351846
TypeSmall organic molecule
Emp. Form.C26H26FN5O2
Mol. Mass.459.5153
SMILESNC(=N)c1cccc(c1)C(=O)N[C@@H](C(=O)N1CCN(CC1)c1ccc(F)cc1)c1ccccc1