Reaction Details
TargetCoagulation factor X
LigandBDBM50097771
Substrate/Competitorn/a
Meas. Tech.ChEBML_69661
Ki 13±n/a nM
Citation Jones, SDLiebeschuetz, JWMorgan, PJMurray, CWRimmer, ADRoscoe, JMWaszkowycz, BWelsh, PMWylie, WAYoung, SCMartin, HMahler, JBrady, LWilkinson, K The design of phenylglycine containing benzamidine carboxamides as potent and selective inhibitors of factor Xa. Bioorg Med Chem Lett11:733-6 (2001) Coagulation factor X
Name:Coagulation factor X
Type:Enzyme
Mol. Mass.:54726.60
Organism:Homo sapiens (Human)
Description:n/a
Residue:488
BDBM50097771
NameBDBM50097771
Synonyms:3-[(Z)-AMINO(IMINO)METHYL]-N-[2-(4-BENZOYL-1-PIPERIDINYL)-2-OXO-1-PHENYLETHYL]BENZAMIDE N-[(R)-2-(4-Benzoyl-piperidin-1-yl)-2-oxo-1-phenyl-ethyl]-3-carbamimidoyl-benzamide | N-[2-(4-Benzoyl-piperidin-1-yl)-2-oxo-1-phenyl-ethyl]-3-carbamimidoyl-benzamide
TypeSmall organic molecule
Emp. Form.C28H28N4O3
Mol. Mass.468.5469
SMILESNC(=N)c1cccc(c1)C(=O)N[C@@H](C(=O)N1CCC(CC1)C(=O)c1ccccc1)c1ccccc1