Reaction Details
TargetCalcitonin gene-related peptide type 1 receptor/Receptor activity-modifying protein 1
LigandBDBM50541406
Substrate/Competitorn/a
Meas. Tech.ChEMBL_1984204 (CHEMBL4617610)
Ki 0.007000±n/a nM
Citation Dubowchik, GMConway, CMXin, AW Blocking the CGRP Pathway for Acute and Preventive Treatment of Migraine: The Evolution of Success. J Med Chem63:6600-6623 (2020) 
 
Calcitonin gene-related peptide type 1 receptor/Receptor activity-modifying protein 1
Name:Calcitonin gene-related peptide type 1 receptor/Receptor activity-modifying protein 1
Synonyms:Calcitonin-gene-related peptide receptor, CALCRL/RAMP1
Type:n/a
Mol. Mass.:n/a
Description:ASSAY_ID of EBI is 327200
Components:This complex has 2 components.
Component 1
Name:Calcitonin gene-related peptide type 1 receptor
Type:Enzyme Catalytic Domain
Mol. Mass.:52980.45
Organism:Homo sapiens (Human)
Description:Q16602
Residue:461
Component 2
Name:Receptor activity-modifying protein 1
Synonyms:Calcitonin-gene-related peptide receptor, CALCRL/RAMP1 RAMP1_HUMAN
Type:PROTEIN
Mol. Mass.:16992.80
Organism:Homo sapiens (Human)
Description:EBI_100673
Residue:148
BDBM50541406
NameBDBM50541406
Synonyms:CHEMBL4649325
TypeSmall organic molecule
Emp. Form.C27H29N5O2
Mol. Mass.455.5515
SMILESC[C@H](c1ccc(nc1)C(=O)NCc1cc(C)nc(c1)C1CCC1)[C@@]1(C)C(=O)Nc2ncccc12