Reaction Details
TargetCalcitonin gene-related peptide type 1 receptor/Receptor activity-modifying protein 1
LigandBDBM50541407
Substrate/Competitorn/a
Meas. Tech.ChEMBL_1984204 (CHEMBL4617610)
Ki 0.020000±n/a nM
Citation Dubowchik, GMConway, CMXin, AW Blocking the CGRP Pathway for Acute and Preventive Treatment of Migraine: The Evolution of Success. J Med Chem63:6600-6623 (2020) 
 
Calcitonin gene-related peptide type 1 receptor/Receptor activity-modifying protein 1
Name:Calcitonin gene-related peptide type 1 receptor/Receptor activity-modifying protein 1
Synonyms:Calcitonin-gene-related peptide receptor, CALCRL/RAMP1
Type:n/a
Mol. Mass.:n/a
Description:ASSAY_ID of EBI is 327200
Components:This complex has 2 components.
Component 1
Name:Calcitonin gene-related peptide type 1 receptor
Type:Enzyme Catalytic Domain
Mol. Mass.:52980.45
Organism:Homo sapiens (Human)
Description:Q16602
Residue:461
Component 2
Name:Receptor activity-modifying protein 1
Synonyms:Calcitonin-gene-related peptide receptor, CALCRL/RAMP1 RAMP1_HUMAN
Type:PROTEIN
Mol. Mass.:16992.80
Organism:Homo sapiens (Human)
Description:EBI_100673
Residue:148
BDBM50541407
NameBDBM50541407
Synonyms:CHEMBL4638635
TypeSmall organic molecule
Emp. Form.C31H35N5O3
Mol. Mass.525.6413
SMILESCc1cccc(c1)[C@H]1CC[C@H](N1C(=O)CNC(=O)c1ccc(Cc2cc(C)n[nH]c2=O)c(C)c1)C(C)(C)C#N