Reaction Details
TargetCalcitonin gene-related peptide type 1 receptor/Receptor activity-modifying protein 1
LigandBDBM50541408
Substrate/Competitorn/a
Meas. Tech.ChEMBL_1984204 (CHEMBL4617610)
Ki 0.004000±n/a nM
Citation Dubowchik, GMConway, CMXin, AW Blocking the CGRP Pathway for Acute and Preventive Treatment of Migraine: The Evolution of Success. J Med Chem63:6600-6623 (2020) 
 
Calcitonin gene-related peptide type 1 receptor/Receptor activity-modifying protein 1
Name:Calcitonin gene-related peptide type 1 receptor/Receptor activity-modifying protein 1
Synonyms:Calcitonin-gene-related peptide receptor, CALCRL/RAMP1
Type:n/a
Mol. Mass.:n/a
Description:ASSAY_ID of EBI is 327200
Components:This complex has 2 components.
Component 1
Name:Calcitonin gene-related peptide type 1 receptor
Type:Enzyme Catalytic Domain
Mol. Mass.:52980.45
Organism:Homo sapiens (Human)
Description:Q16602
Residue:461
Component 2
Name:Receptor activity-modifying protein 1
Synonyms:Calcitonin-gene-related peptide receptor, CALCRL/RAMP1 RAMP1_HUMAN
Type:PROTEIN
Mol. Mass.:16992.80
Organism:Homo sapiens (Human)
Description:EBI_100673
Residue:148
BDBM50541408
NameBDBM50541408
Synonyms:CHEMBL4643140
TypeSmall organic molecule
Emp. Form.C31H31F2N5O4
Mol. Mass.575.6057
SMILESCc1cc(Oc2c(C)cc(cc2F)C(=O)N[C@H]2C[C@]3(CC[C@@H](N3C2=O)C(C)(C)C#N)c2ccc(F)cc2C)c(=O)[nH]n1