Reaction Details
TargetCalcitonin gene-related peptide type 1 receptor/Receptor activity-modifying protein 1
LigandBDBM362044
Substrate/Competitorn/a
Meas. Tech.ChEMBL_1984211 (CHEMBL4617617)
Ki 0.015000±n/a nM
Citation Dubowchik, GMConway, CMXin, AW Blocking the CGRP Pathway for Acute and Preventive Treatment of Migraine: The Evolution of Success. J Med Chem63:6600-6623 (2020) 
 
Calcitonin gene-related peptide type 1 receptor/Receptor activity-modifying protein 1
Name:Calcitonin gene-related peptide type 1 receptor/Receptor activity-modifying protein 1
Synonyms:Calcitonin-gene-related peptide receptor, CALCRL/RAMP1
Type:n/a
Mol. Mass.:n/a
Description:ASSAY_ID of EBI is 327200
Components:This complex has 2 components.
Component 1
Name:Calcitonin gene-related peptide type 1 receptor
Type:Enzyme Catalytic Domain
Mol. Mass.:52980.45
Organism:Homo sapiens (Human)
Description:Q16602
Residue:461
Component 2
Name:Receptor activity-modifying protein 1
Synonyms:Calcitonin-gene-related peptide receptor, CALCRL/RAMP1 RAMP1_HUMAN
Type:PROTEIN
Mol. Mass.:16992.80
Organism:Homo sapiens (Human)
Description:EBI_100673
Residue:148
BDBM362044
NameBDBM362044
Synonyms:US10272077, Example 4 | US9833448, Example 4
TypeSmall organic molecule
Emp. Form.C29H23F6N5O3
Mol. Mass.603.515
SMILESC[C@@H]1[C@@H](C[C@H](NC(=O)c2cnc3C[C@]4(Cc3c2)C(=O)Nc2ncccc42)C(=O)N1CC(F)(F)F)c1c(F)ccc(F)c1F