Reaction Details
TargetXanthine dehydrogenase/oxidase
LigandBDBM50098063
Substrate/Competitorn/a
Meas. Tech.ChEBML_216938
IC50 15±n/a nM
Citation Ishibuchi, SMorimoto, HOe, TIkebe, TInoue, HFukunari, AKamezawa, MYamada, INaka, Y Synthesis and structure-activity relationships of 1-phenylpyrazoles as xanthine oxidase inhibitors. Bioorg Med Chem Lett11:879-82 (2001) Xanthine dehydrogenase/oxidase
Name:Xanthine dehydrogenase/oxidase
Type:Protein
Mol. Mass.:146809.00
Organism:Bos taurus (Bovine)
Description:P80457
Residue:1332
BDBM50098063
NameBDBM50098063
Synonyms:1-(4-Butoxy-3-cyano-phenyl)-1H-pyrazole-4-carboxylic acid | CHEMBL440197
TypeSmall organic molecule
Emp. Form.C15H15N3O3
Mol. Mass.285.2979
SMILESCCCCOc1ccc(cc1C#N)-n1cc(cn1)C(O)=O