Reaction Details
TargetXanthine dehydrogenase/oxidase
LigandBDBM50098069
Substrate/Competitorn/a
Meas. Tech.ChEBML_216938
IC50 700±n/a nM
Citation Ishibuchi, SMorimoto, HOe, TIkebe, TInoue, HFukunari, AKamezawa, MYamada, INaka, Y Synthesis and structure-activity relationships of 1-phenylpyrazoles as xanthine oxidase inhibitors. Bioorg Med Chem Lett11:879-82 (2001) Xanthine dehydrogenase/oxidase
Name:Xanthine dehydrogenase/oxidase
Type:Protein
Mol. Mass.:146809.00
Organism:Bos taurus (Bovine)
Description:P80457
Residue:1332
BDBM50098069
NameBDBM50098069
Synonyms:1-[3-Cyano-4-(2-dimethylamino-ethoxy)-phenyl]-1H-pyrazole-4-carboxylic acid | CHEMBL172687
TypeSmall organic molecule
Emp. Form.C15H16N4O3
Mol. Mass.300.3125
SMILESCN(C)CCOc1ccc(cc1C#N)-n1cc(cn1)C(O)=O