Reaction Details
TargetXanthine dehydrogenase/oxidase
LigandBDBM50098072
Substrate/Competitorn/a
Meas. Tech.ChEBML_216938
IC50 21±n/a nM
Citation Ishibuchi, SMorimoto, HOe, TIkebe, TInoue, HFukunari, AKamezawa, MYamada, INaka, Y Synthesis and structure-activity relationships of 1-phenylpyrazoles as xanthine oxidase inhibitors. Bioorg Med Chem Lett11:879-82 (2001) Xanthine dehydrogenase/oxidase
Name:Xanthine dehydrogenase/oxidase
Type:Protein
Mol. Mass.:146809.00
Organism:Bos taurus (Bovine)
Description:P80457
Residue:1332
BDBM50098072
NameBDBM50098072
Synonyms:1-(3-Cyano-4-octyloxy-phenyl)-1H-pyrazole-4-carboxylic acid | CHEMBL171584
TypeSmall organic molecule
Emp. Form.C19H23N3O3
Mol. Mass.341.4042
SMILESCCCCCCCCOc1ccc(cc1C#N)-n1cc(cn1)C(O)=O