Reaction Details
TargetMuscarinic acetylcholine receptor M2
LigandBDBM50098079
Substrate/Competitorn/a
Meas. Tech.ChEBML_139761
Ki 0.400000±n/a nM
Citation Wang, YChackalamannil, SChang, WGreenlee, WRuperto, VDuffy, RAMcQuade, RLachowicz, JE Design and synthesis of ether analogues as potent and selective M2 muscarinic receptor antagonists. Bioorg Med Chem Lett11:891-4 (2001) Muscarinic acetylcholine receptor M2
Name:Muscarinic acetylcholine receptor M2
Type:GPCR
Mol. Mass.:51730.61
Organism:Homo sapiens (Human)
Description:P08172
Residue:466
BDBM50098079
NameBDBM50098079
Synonyms:CHEMBL170298 | {4-[4-(Benzo[1,3]dioxole-5-sulfonyl)-phenoxy]-[1,4']bipiperidinyl-1'-yl}-(2,3-dimethyl-phenyl)-methanone
TypeSmall organic molecule
Emp. Form.C32H36N2O6S
Mol. Mass.576.703
SMILESCc1cccc(C(=O)N2CCC(CC2)N2CCC(CC2)Oc2ccc(cc2)S(=O)(=O)c2ccc3OCOc3c2)c1C