Reaction Details
TargetMuscarinic acetylcholine receptor M2
LigandBDBM50098087
Substrate/Competitorn/a
Meas. Tech.ChEBML_139761
Ki 1.6±n/a nM
Citation Wang, YChackalamannil, SChang, WGreenlee, WRuperto, VDuffy, RAMcQuade, RLachowicz, JE Design and synthesis of ether analogues as potent and selective M2 muscarinic receptor antagonists. Bioorg Med Chem Lett11:891-4 (2001) Muscarinic acetylcholine receptor M2
Name:Muscarinic acetylcholine receptor M2
Type:GPCR
Mol. Mass.:51730.61
Organism:Homo sapiens (Human)
Description:P08172
Residue:466
BDBM50098087
NameBDBM50098087
Synonyms:CHEMBL171411 | {4-[4-(Benzo[1,3]dioxole-5-sulfonyl)-phenoxy]-[1,4']bipiperidinyl-1'-yl}-phenyl-methanone
TypeSmall organic molecule
Emp. Form.C30H32N2O6S
Mol. Mass.548.65
SMILESO=C(N1CCC(CC1)N1CCC(CC1)Oc1ccc(cc1)S(=O)(=O)c1ccc2OCOc2c1)c1ccccc1