Reaction Details
TargetThromboxane A2 receptor
LigandBDBM50098926
Substrate/Competitorn/a
Meas. Tech.ChEBML_207655
IC50 1.1±n/a nM
Citation Michaux, CRolin, SDogné, JMDurant, FMasereel, BDelarge, JWouters, J Structure determination and comparison of BM567, a sulfonylurea, with terbogrel, two compounds with dual action, thromboxane receptor antagonism and thromboxane synthase inhibition. Bioorg Med Chem Lett11:1019-22 (2001) Thromboxane A2 receptor
Name:Thromboxane A2 receptor
Type:Enyzme
Mol. Mass.:37445.28
Organism:Homo sapiens (Human)
Description:P21731
Residue:343
BDBM50098926
NameBDBM50098926
Synonyms:1-(2-Cyclohexylamino-5-nitro-benzenesulfonyl)-3-pentyl-urea | CHEMBL7353
TypeSmall organic molecule
Emp. Form.C18H28N4O5S
Mol. Mass.412.504
SMILESCCCCCNC(=O)NS(=O)(=O)c1cc(ccc1NC1CCCCC1)[N+]([O-])=O