Reaction Details
TargetCarbonic anhydrase 9
LigandBDBM50214744
Substrate/Competitorn/a
Meas. Tech.ChEMBL_1986668 (CHEMBL4620215)
IC50 9390±n/a nM
Citation Aneja, BQueen, AKhan, PShamsi, FHussain, AHasan, PRizvi, MMADaniliuc, CGAlajmi, MFMohsin, MHassan, MIAbid, M Design, synthesis & biological evaluation of ferulic acid-based small molecule inhibitors against tumor-associated carbonic anhydrase IX. Bioorg Med Chem28:0 (2020) 
 
Carbonic anhydrase 9
Name:Carbonic anhydrase 9
Type:Enzyme
Mol. Mass.:49669.03
Organism:Homo sapiens (Human)
Description:Catalytic domain of human cloned isozyme was used in the assay
Residue:459
BDBM50214744
NameBDBM50214744
Synonyms:(2E)-3-(4-hydroxy-3-methoxyphenyl)prop-2-enoic acid CHEMBL32749 ferulic acid
TypeSmall organic molecule
Emp. Form.C10H10O4
Mol. Mass.194.184
SMILESCOc1cc(\C=C\C(O)=O)ccc1O