Reaction Details
TargetProtein kinase C gamma type
LigandBDBM50099067
Substrate/Competitorn/a
Meas. Tech.ChEBML_219115
Ki 327±n/a nM
Citation Qiao, LZhao, LYRong, SBWu, XWWang, SFujii, TKazanietz, MGRauser, LSavage, JRoth, BLFlippen-Anderson, JKozikowski, AP Rational design, synthesis, and biological evaluation of rigid pyrrolidone analogues as potential inhibitors of prostate cancer cell growth. Bioorg Med Chem Lett11:955-9 (2001) Protein kinase C gamma type
Name:Protein kinase C gamma type
Type:Enzyme
Mol. Mass.:78458.05
Organism:Homo sapiens (Human)
Description:The recombinant human PKC enzymes were produced using a baculovirus expression system in SF9 cells
Residue:697
BDBM50099067
NameBDBM50099067
Synonyms:CHEMBL173348 | Dodecanoic acid (3S,3aR,8S,8aS)-3-hydroxymethyl-8-isopropyl-8-methyl-1-oxo-1,2,3,3a,8,8a-hexahydro-indeno[1,2-c]pyrrol-6-yl ester
TypeSmall organic molecule
Emp. Form.C28H43NO4
Mol. Mass.457.6453
SMILESCCCCCCCCCCCC(=O)Oc1ccc2[C@@H]3[C@@H](CO)NC(=O)[C@@H]3[C@](C)(C(C)C)c2c1