Reaction Details
TargetBeta-lactamase
LigandBDBM50021954
Substrate/Competitorn/a
Meas. Tech.ChEBML_35530
IC50 66000±n/a nM
Citation Sandanayaka, VPFeigelson, GBPrashad, ASYang, YPetersen, PJ Allyl and propargyl substituted penam sulfones as versatile intermediates toward the syntheses of new beta-lactamase inhibitors. Bioorg Med Chem Lett11:997-1000 (2001) Beta-lactamase
Name:Beta-lactamase
Type:Protien
Mol. Mass.:41561.62
Organism:Escherichia coli
Description:P00811
Residue:377
BDBM50021954
NameBDBM50021954
Synonyms:(2S,5R)-3,3-Dimethyl-4,4,7-trioxo-4lambda*6*-thia-1-aza-bicyclo[3.2.0]heptane-2-carboxylic acid 3,3-Dimethyl-4,4,7-trioxo-4lambda*6*-thia-1-aza-bicyclo[3.2.0]heptane-2-carboxylic acid CHEMBL403 SULBACTAM US20230322715, Compound ALK-09 | US9120808, Sulbactam sodium salt
TypeSmall organic molecule
Emp. Form.C8H11NO5S
Mol. Mass.233.242
SMILESCC1(C)[C@@H](N2[C@@H](CC2=O)S1(=O)=O)C(O)=O