Reaction Details
TargetSodium-dependent serotonin transporter
LigandBDBM50051753
Substrate/Competitorn/a
Meas. Tech.ChEMBL_201808 (CHEMBL806802)
Ki 0.23±n/a nM
Citation Davies, HMGilliatt, VKuhn, LASaikali, ERen, PHammond, PSSexton, TChilders, SR Synthesis of 2beta-acyl-3beta-(substituted naphthyl)-8-azabicyclo[3.2.1]octanes and their binding affinities at dopamine and serotonin transport sites. J Med Chem44:1509-15 (2001) Sodium-dependent serotonin transporter
Name:Sodium-dependent serotonin transporter
Type:Multi-pass membrane protein
Mol. Mass.:70168.43
Organism:Rattus norvegicus (rat)
Description:P31652
Residue:630
BDBM50051753
NameBDBM50051753
Synonyms:1-(3-Naphthalen-2-yl-8-aza-bicyclo[3.2.1]oct-2-yl)-propan-1-one | CHEMBL36720
TypeSmall organic molecule
Emp. Form.C20H23NO
Mol. Mass.293.4027
SMILESCCC(=O)C1C2CCC(CC1c1ccc3ccccc3c1)N2