Reaction Details
TargetSodium-dependent dopamine transporter
LigandBDBM50051753
Substrate/Competitorn/a
Meas. Tech.ChEMBL_62151 (CHEMBL675907)
IC50 0.03±n/a nM
Citation Davies, HMGilliatt, VKuhn, LASaikali, ERen, PHammond, PSSexton, TChilders, SR Synthesis of 2beta-acyl-3beta-(substituted naphthyl)-8-azabicyclo[3.2.1]octanes and their binding affinities at dopamine and serotonin transport sites. J Med Chem44:1509-15 (2001) Sodium-dependent dopamine transporter
Name:Sodium-dependent dopamine transporter
Type:Multi-pass membrane protein
Mol. Mass.:68749.45
Organism:Rattus norvegicus (rat)
Description:P23977
Residue:619
BDBM50051753
NameBDBM50051753
Synonyms:1-(3-Naphthalen-2-yl-8-aza-bicyclo[3.2.1]oct-2-yl)-propan-1-one | CHEMBL36720
TypeSmall organic molecule
Emp. Form.C20H23NO
Mol. Mass.293.4027
SMILESCCC(=O)C1C2CCC(CC1c1ccc3ccccc3c1)N2