Reaction Details
Target5-hydroxytryptamine receptor 2A
LigandBDBM50099275
Substrate/Competitorn/a
Meas. Tech.ChEMBL_2277 (CHEMBL617063)
Ki 0.09±n/a nM
Citation Rowley, MHallett, DJGoodacre, SMoyes, CCrawforth, JSparey, TJPatel, SMarwood, RPatel, SThomas, SHitzel, LO'Connor, DSzeto, NCastro, JLHutson, PHMacLeod, AM 3-(4-Fluoropiperidin-3-yl)-2-phenylindoles as high affinity, selective, and orally bioavailable h5-HT(2A) receptor antagonists. J Med Chem44:1603-14 (2001) 5-hydroxytryptamine receptor 2A
Name:5-hydroxytryptamine receptor 2A
Type:undefined
Mol. Mass.:52607.65
Organism:Homo sapiens (Human)
Description:P28223
Residue:471
BDBM50099275
NameBDBM50099275
Synonyms:6-Fluoro-3-(4-fluoro-piperidin-3-yl)-1H-indole-2-carboxylic acid phenylamide | CHEMBL41125
TypeSmall organic molecule
Emp. Form.C20H19F2N3O
Mol. Mass.355.3812
SMILESF[C@@H]1CCNCC1c1c([nH]c2cc(F)ccc12)C(=O)Nc1ccccc1