Reaction Details
Target5-hydroxytryptamine receptor 2A
LigandBDBM50099258
Substrate/Competitorn/a
Meas. Tech.ChEMBL_2277 (CHEMBL617063)
Ki 0.23±n/a nM
Citation Rowley, MHallett, DJGoodacre, SMoyes, CCrawforth, JSparey, TJPatel, SMarwood, RPatel, SThomas, SHitzel, LO'Connor, DSzeto, NCastro, JLHutson, PHMacLeod, AM 3-(4-Fluoropiperidin-3-yl)-2-phenylindoles as high affinity, selective, and orally bioavailable h5-HT(2A) receptor antagonists. J Med Chem44:1603-14 (2001) 5-hydroxytryptamine receptor 2A
Name:5-hydroxytryptamine receptor 2A
Type:undefined
Mol. Mass.:52607.65
Organism:Homo sapiens (Human)
Description:P28223
Residue:471
BDBM50099258
NameBDBM50099258
Synonyms:6-Fluoro-3-(4-fluoro-piperidin-3-yl)-2-naphthalen-2-yl-1H-indole | CHEMBL297136
TypeSmall organic molecule
Emp. Form.C23H20F2N2
Mol. Mass.362.4151
SMILESF[C@@H]1CCNCC1c1c([nH]c2cc(F)ccc12)-c1ccc2ccccc2c1