Reaction Details
TargetNeuropeptide FF receptor 2
LigandBDBM50099302
Substrate/Competitorn/a
Meas. Tech.ChEMBL_140778 (CHEMBL752767)
Ki 1400±n/a nM
Citation Prokai, LProkai-Tatrai, KZharikova, ALi, XRocca, JR Combinatorial lead optimization of a neuropeptide FF antagonist. J Med Chem44:1623-6 (2001) Neuropeptide FF receptor 2
Name:Neuropeptide FF receptor 2
Type:Enzyme Catalytic Domain
Mol. Mass.:47725.66
Organism:RAT
Description:NPFF2 0 RAT::Q9EQD2
Residue:417
BDBM50099302
NameBDBM50099302
Synonyms:2-{2-[2-(5-Dimethylamino-naphthalene-1-sulfonylamino)-acetylamino]-3-hydroxy-propionylamino}-5-guanidino-pentanoic acid amide | CHEMBL409118
TypeSmall organic molecule
Emp. Form.C23H34N8O6S
Mol. Mass.550.631
SMILESCN(C)c1cccc2c(cccc12)S(=O)(=O)NCC(=O)NC(CO)C(=O)NC(CCCNC(N)=N)C(N)=O