Reaction Details
TargetNeuropeptide FF receptor 2
LigandBDBM50099303
Substrate/Competitorn/a
Meas. Tech.ChEMBL_140778 (CHEMBL752767)
Ki 13600±n/a nM
Citation Prokai, LProkai-Tatrai, KZharikova, ALi, XRocca, JR Combinatorial lead optimization of a neuropeptide FF antagonist. J Med Chem44:1623-6 (2001) Neuropeptide FF receptor 2
Name:Neuropeptide FF receptor 2
Type:Enzyme Catalytic Domain
Mol. Mass.:47725.66
Organism:RAT
Description:NPFF2 0 RAT::Q9EQD2
Residue:417
BDBM50099303
NameBDBM50099303
Synonyms:2-{[1-(5-Dimethylamino-naphthalene-1-sulfonyl)-pyrrolidine-2-carbonyl]-amino}-pentanedioic acid 5-amide 1-[(1-carbamoyl-4-guanidino-butyl)-amide] | CHEMBL42678
TypeSmall organic molecule
Emp. Form.C28H41N9O6S
Mol. Mass.631.747
SMILESCN(C)c1cccc2c(cccc12)S(=O)(=O)N1CCCC1C(=O)NC(CCC(N)=O)C(=O)NC(CCCNC(N)=N)C(N)=O