Reaction Details
TargetSubstance-P receptor
LigandBDBM50099514
Substrate/Competitorn/a
Meas. Tech.ChEBML_141776
IC50 0.190000±n/a nM
Citation Cooper, LCChicchi, GGDinnell, KElliott, JMHollingworth, GJKurtz, MMLocker, KLMorrison, DShaw, DETsao, KLWatt, APWilliams, ARSwain, CJ 2-Aryl indole NK1 receptor antagonists: optimisation of indole substitution. Bioorg Med Chem Lett11:1233-6 (2001) Substance-P receptor
Name:Substance-P receptor
Type:G Protein-Coupled Receptor (GPCR)
Mol. Mass.:46254.43
Organism:Homo sapiens (Human)
Description:P25103
Residue:407
BDBM50099514
NameBDBM50099514
Synonyms:3-[5-Acetyl-2-(4-chloro-phenyl)-1-methyl-1H-indol-3-yl]-1-(4-benzyl-4-hydroxy-piperidin-1-yl)-propan-1-one | CHEMBL21385
TypeSmall organic molecule
Emp. Form.C32H33ClN2O3
Mol. Mass.529.069
SMILESCC(=O)c1ccc2n(C)c(c(CCC(=O)N3CCC(O)(Cc4ccccc4)CC3)c2c1)-c1ccc(Cl)cc1