Reaction Details
TargetSubstance-P receptor
LigandBDBM50099519
Substrate/Competitorn/a
Meas. Tech.ChEBML_141776
IC50 0.780000±n/a nM
Citation Cooper, LCChicchi, GGDinnell, KElliott, JMHollingworth, GJKurtz, MMLocker, KLMorrison, DShaw, DETsao, KLWatt, APWilliams, ARSwain, CJ 2-Aryl indole NK1 receptor antagonists: optimisation of indole substitution. Bioorg Med Chem Lett11:1233-6 (2001) Substance-P receptor
Name:Substance-P receptor
Type:G Protein-Coupled Receptor (GPCR)
Mol. Mass.:46254.43
Organism:Homo sapiens (Human)
Description:P25103
Residue:407
BDBM50099519
NameBDBM50099519
Synonyms:1-(4-Benzyl-4-hydroxy-piperidin-1-yl)-3-[6-chloro-2-(4-chloro-phenyl)-imidazo[1,2-a]pyridin-3-yl]-propan-1-one | CHEMBL21607
TypeSmall organic molecule
Emp. Form.C28H27Cl2N3O2
Mol. Mass.508.439
SMILESOC1(Cc2ccccc2)CCN(CC1)C(=O)CCc1c(nc2ccc(Cl)cn12)-c1ccc(Cl)cc1