Reaction Details
TargetSubstance-P receptor
LigandBDBM50099528
Substrate/Competitorn/a
Meas. Tech.ChEBML_141776
IC50 0.220000±n/a nM
Citation Cooper, LCChicchi, GGDinnell, KElliott, JMHollingworth, GJKurtz, MMLocker, KLMorrison, DShaw, DETsao, KLWatt, APWilliams, ARSwain, CJ 2-Aryl indole NK1 receptor antagonists: optimisation of indole substitution. Bioorg Med Chem Lett11:1233-6 (2001) Substance-P receptor
Name:Substance-P receptor
Type:G Protein-Coupled Receptor (GPCR)
Mol. Mass.:46254.43
Organism:Homo sapiens (Human)
Description:P25103
Residue:407
BDBM50099528
NameBDBM50099528
Synonyms:1-(4-Benzyl-4-hydroxy-piperidin-1-yl)-3-[5-bromo-2-(4-chloro-phenyl)-1-methyl-1H-indol-3-yl]-propan-1-one | CHEMBL447473
TypeSmall organic molecule
Emp. Form.C30H30BrClN2O2
Mol. Mass.565.928
SMILESCn1c(c(CCC(=O)N2CCC(O)(Cc3ccccc3)CC2)c2cc(Br)ccc12)-c1ccc(Cl)cc1