Reaction Details
TargetSubstance-P receptor
LigandBDBM50099550
Substrate/Competitorn/a
Meas. Tech.ChEBML_141778
IC50 0.280000±n/a nM
Citation Dinnell, KChicchi, GGDhar, MJElliott, JMHollingworth, GJKurtz, MMRidgill, MPRycroft, WTsao, KLWilliams, ARSwain, CJ 2-Aryl indole NK1 receptor antagonists: optimisation of the 2-aryl ring and the indole nitrogen substituent. Bioorg Med Chem Lett11:1237-40 (2001) Substance-P receptor
Name:Substance-P receptor
Type:G Protein-Coupled Receptor (GPCR)
Mol. Mass.:46254.43
Organism:Homo sapiens (Human)
Description:P25103
Residue:407
BDBM50099550
NameBDBM50099550
Synonyms:3-[5-Chloro-2-(4-chloro-phenyl)-1-methyl-1H-indol-3-yl]-1-[4-(2-methoxy-phenyl)-piperazin-1-yl]-propan-1-one | CHEMBL416372
TypeSmall organic molecule
Emp. Form.C29H29Cl2N3O2
Mol. Mass.522.465
SMILESCOc1ccccc1N1CCN(CC1)C(=O)CCc1c(-c2ccc(Cl)cc2)n(C)c2ccc(Cl)cc12