Reaction Details
TargetNeuromedin-K receptor
LigandBDBM50099626
Substrate/Competitorn/a
Meas. Tech.ChEMBL_220885 (CHEMBL824640)
Ki 1.5±n/a nM
Citation Blaney, FERaveglia, LFArtico, MCavagnera, SDartois, CFarina, CGrugni, MGagliardi, SLuttmann, MAMartinelli, MNadler, GMParini, CPetrillo, PSarau, HMScheideler, MAHay, DWGiardina, GA Stepwise modulation of neurokinin-3 and neurokinin-2 receptor affinity and selectivity in quinoline tachykinin receptor antagonists. J Med Chem44:1675-89 (2001) Neuromedin-K receptor
Name:Neuromedin-K receptor
Type:Enzyme
Mol. Mass.:52221.96
Organism:Homo sapiens (Human)
Description:P29371
Residue:465
BDBM50099626
NameBDBM50099626
Synonyms:3-[1,4']Bipiperidinyl-1'-ylmethyl-2-phenyl-quinoline-4-carboxylic acid (1-phenyl-propyl)-amide | CHEMBL47544
TypeSmall organic molecule
Emp. Form.C36H42N4O
Mol. Mass.546.7449
SMILESCC[C@H](NC(=O)c1c(CN2CCC(CC2)N2CCCCC2)c(nc2ccccc12)-c1ccccc1)c1ccccc1