Reaction Details
TargetSubstance-K receptor
LigandBDBM50099635
Substrate/Competitorn/a
Meas. Tech.ChEMBL_209033 (CHEMBL818108)
Ki 2.4±n/a nM
Citation Blaney, FERaveglia, LFArtico, MCavagnera, SDartois, CFarina, CGrugni, MGagliardi, SLuttmann, MAMartinelli, MNadler, GMParini, CPetrillo, PSarau, HMScheideler, MAHay, DWGiardina, GA Stepwise modulation of neurokinin-3 and neurokinin-2 receptor affinity and selectivity in quinoline tachykinin receptor antagonists. J Med Chem44:1675-89 (2001) Substance-K receptor
Name:Substance-K receptor
Type:Protein
Mol. Mass.:44455.78
Organism:Homo sapiens (Human)
Description:P21452
Residue:398
BDBM50099635
NameBDBM50099635
Synonyms:2-Phenyl-3-piperazin-1-ylmethyl-quinoline-4-carboxylic acid (1-cyclohexyl-ethyl)-amide | CHEMBL47412
TypeSmall organic molecule
Emp. Form.C29H36N4O
Mol. Mass.456.6223
SMILESC[C@H](NC(=O)c1c(CN2CCNCC2)c(nc2ccccc12)-c1ccccc1)C1CCCCC1