Reaction Details
TargetNeuromedin-K receptor
LigandBDBM50099644
Substrate/Competitorn/a
Meas. Tech.ChEMBL_220885 (CHEMBL824640)
Ki 1250±n/a nM
Citation Blaney, FERaveglia, LFArtico, MCavagnera, SDartois, CFarina, CGrugni, MGagliardi, SLuttmann, MAMartinelli, MNadler, GMParini, CPetrillo, PSarau, HMScheideler, MAHay, DWGiardina, GA Stepwise modulation of neurokinin-3 and neurokinin-2 receptor affinity and selectivity in quinoline tachykinin receptor antagonists. J Med Chem44:1675-89 (2001) Neuromedin-K receptor
Name:Neuromedin-K receptor
Type:Enzyme
Mol. Mass.:52221.96
Organism:Homo sapiens (Human)
Description:P29371
Residue:465
BDBM50099644
NameBDBM50099644
Synonyms:3-(4-Isopropyl-piperazin-1-ylmethyl)-2-phenyl-quinoline-4-carboxylic acid cyclohexylamide | CHEMBL45362
TypeSmall organic molecule
Emp. Form.C30H38N4O
Mol. Mass.470.6489
SMILESCC(C)N1CCN(Cc2c(nc3ccccc3c2C(=O)NC2CCCCC2)-c2ccccc2)CC1