Reaction Details
TargetDual specificity mitogen-activated protein kinase kinase 1
LigandBDBM50099984
Substrate/Competitorn/a
Meas. Tech.ChEMBL_60730 (CHEMBL672143)
IC50 14±n/a nM
Citation Zhang, NWu, BEudy, NWang, YYe, FPowell, DWissner, AFeldberg, LRKim, SCMallon, RKovacs, EDToral-Barza, LKohler, CA MEK (MAPKK) inhibitors. Part 2: structure-activity relationships of 4-anilino-3-cyano-6,7-dialkoxyquinolines. Bioorg Med Chem Lett11:1407-10 (2001) Dual specificity mitogen-activated protein kinase kinase 1
Name:Dual specificity mitogen-activated protein kinase kinase 1
Type:Other Protein Type
Mol. Mass.:43439.03
Organism:Homo sapiens (Human)
Description:Full-length human MEK-1 was generated by PCR and purified as a fusion protein from Escherichia coli lysates.
Residue:393
BDBM50099984
NameBDBM50099984
Synonyms:4-(4-Furan-3-ylmethyl-phenylamino)-6-methoxy-7-(3-morpholin-4-yl-propoxy)-quinoline-3-carbonitrile | CHEMBL30790
TypeSmall organic molecule
Emp. Form.C29H30N4O4
Mol. Mass.498.5729
SMILESCOc1cc2c(Nc3ccc(Cc4ccoc4)cc3)c(cnc2cc1OCCCN1CCOCC1)C#N