Reaction Details
TargetDual specificity mitogen-activated protein kinase kinase 1
LigandBDBM50099976
Substrate/Competitorn/a
Meas. Tech.ChEMBL_60730 (CHEMBL672143)
IC50 29±n/a nM
Citation Zhang, NWu, BEudy, NWang, YYe, FPowell, DWissner, AFeldberg, LRKim, SCMallon, RKovacs, EDToral-Barza, LKohler, CA MEK (MAPKK) inhibitors. Part 2: structure-activity relationships of 4-anilino-3-cyano-6,7-dialkoxyquinolines. Bioorg Med Chem Lett11:1407-10 (2001) Dual specificity mitogen-activated protein kinase kinase 1
Name:Dual specificity mitogen-activated protein kinase kinase 1
Type:Other Protein Type
Mol. Mass.:43439.03
Organism:Homo sapiens (Human)
Description:Full-length human MEK-1 was generated by PCR and purified as a fusion protein from Escherichia coli lysates.
Residue:393
BDBM50099976
NameBDBM50099976
Synonyms:6-Methoxy-7-(3-morpholin-4-yl-propoxy)-4-(4-pyridin-3-ylmethyl-phenylamino)-quinoline-3-carbonitrile | CHEMBL287852
TypeSmall organic molecule
Emp. Form.C30H31N5O3
Mol. Mass.509.5988
SMILESCOc1cc2c(Nc3ccc(Cc4cccnc4)cc3)c(cnc2cc1OCCCN1CCOCC1)C#N