Reaction Details
TargetAmyloid-beta precursor protein
LigandBDBM50100136
Substrate/Competitorn/a
Meas. Tech.ChEMBL_35679 (CHEMBL649528)
Ki 5.40±n/a nM
Citation Zhuang, ZPKung, MPHou, CSkovronsky, DMGur, TLPlössl, KTrojanowski, JQLee, VMKung, HF Radioiodinated styrylbenzenes and thioflavins as probes for amyloid aggregates. J Med Chem44:1905-14 (2001) Amyloid-beta precursor protein
Name:Amyloid-beta precursor protein
Type:Single-pass type I membrane protein
Mol. Mass.:86890.41
Organism:Homo sapiens (Human)
Description:P05067
Residue:770
BDBM50100136
NameBDBM50100136
Synonyms:6-Iodo-2-[4-(4-methyl-piperazin-1-yl)-phenyl]-benzothiazole | CHEMBL58092
TypeSmall organic molecule
Emp. Form.C18H18IN3S
Mol. Mass.435.325
SMILESCN1CCN(CC1)c1ccc(cc1)-c1nc2ccc(I)cc2s1