Reaction Details
TargetAlpha-1D adrenergic receptor
LigandBDBM50100204
Substrate/Competitorn/a
Meas. Tech.ChEMBL_32722 (CHEMBL645994)
Ki 0.58±n/a nM
Citation Meyer, MDAltenbach, RJBai, HBasha, FZCarroll, WAKerwin, JFLebold, SALee, EPratt, JKSippy, KBTietje, KWendt, MDBrune, MEBuckner, SAHancock, AADrizin, I Structure-activity studies for a novel series of bicyclic substituted hexahydrobenz[e]isoindole alpha1A adrenoceptor antagonists as potential agents for the symptomatic treatment of benign prostatic hyperplasia. J Med Chem44:1971-85 (2001) Alpha-1D adrenergic receptor
Name:Alpha-1D adrenergic receptor
Type:Protein
Mol. Mass.:59375.97
Organism:Rattus norvegicus (Rat)
Description:P23944
Residue:561
BDBM50100204
NameBDBM50100204
Synonyms:7-Chloro-3-[2-(6-methoxy-1,3,3a,4,5,9b-hexahydro-benzo[e]isoindol-2-yl)-ethyl]-1H-quinazoline-2,4-dione | CHEMBL60471
TypeSmall organic molecule
Emp. Form.C23H24ClN3O3
Mol. Mass.425.908
SMILESCOc1cccc2[C@@H]3CN(CCn4c(=O)[nH]c5cc(Cl)ccc5c4=O)C[C@@H]3CCc12