Reaction Details
TargetIntegrin alpha-IIb/beta-3
LigandBDBM50100365
Substrate/Competitorn/a
Meas. Tech.ChEMBL_70188 (CHEMBL684253)
IC50 2±n/a nM
Citation Pandey, ASeroogy, JVolkots, DSmyth, MSRose, JMehrotra, MMHeath, JRuhter, GSchotten, TScarborough, RM Spirocyclic nonpeptide glycoprotein IIb-IIIa antagonists. Part 2: design of potent antagonists containing the 3-azaspiro[5.5]undecanes. Bioorg Med Chem Lett11:1293-6 (2001) Integrin alpha-IIb/beta-3
Name:Integrin alpha-IIb/beta-3
Synonyms:Glycoprotein IIb/IIIa
Type:n/a
Mol. Mass.:n/a
Description:ASSAY_ID of EBI is 30109
Components:This complex has 2 components.
Component 1
Name:Integrin beta-3
Type:Protein
Mol. Mass.:87038.91
Organism:Homo sapiens (Human)
Description:P05106
Residue:788
Component 2
Name:Integrin alpha-IIb
Synonyms:CD_antigen=CD41 GPIIb Glycoprotein IIb ITGA2B Integrin alpha-IIb heavy chain Integrin alpha-IIb light chain, form 2 Integrin alpha-V/beta-3 and alpha-IIb/beta 3 | Platelet membrane glycoprotein IIb
Type:Protein
Mol. Mass.:113354.85
Organism:Homo sapiens (Human)
Description:P08514
Residue:1039
BDBM50100365
NameBDBM50100365
Synonyms:(S)-2-Benzyloxycarbonylamino-3-[(3-pyridin-4-yl-3-aza-spiro[5.5]undecane-9-carbonyl)-amino]-propionic acid | CHEMBL24649
TypeSmall organic molecule
Emp. Form.C27H34N4O5
Mol. Mass.494.5827
SMILESOC(=O)[C@H](CNC(=O)C1CCC2(CC1)CCN(CC2)c1ccncc1)NC(=O)OCc1ccccc1