Reaction Details
TargetCannabinoid receptor 1
LigandBDBM50543746
Substrate/Competitorn/a
Meas. Tech.ChEMBL_1989774 (CHEMBL4623509)
Ki 7.6±n/a nM
Citation Brizzi, AAiello, FBoccella, SCascio, MGDe Petrocellis, LFrosini, MGado, FLigresti, ALuongo, LMarini, PMugnaini, CPessina, FCorelli, FMaione, SManera, CPertwee, RGDi Marzo, V Synthetic bioactive olivetol-related amides: The influence of the phenolic group in cannabinoid receptor activity. Bioorg Med Chem28:0 (2020) 
 
Cannabinoid receptor 1
Name:Cannabinoid receptor 1
Type:G Protein-Coupled Receptor (GPCR)
Mol. Mass.:52868.96
Organism:Homo sapiens (Human)
Description:P21554
Residue:472
BDBM50543746
NameBDBM50543746
Synonyms:CHEMBL4639040
TypeSmall organic molecule
Emp. Form.C27H45NO3
Mol. Mass.431.6511
SMILESCCCCCCC(C)(C)c1cc(OC)cc(OCCCCCCCC(=O)NCC=C)c1