Reaction Details
TargetCannabinoid receptor 2
LigandBDBM50543739
Substrate/Competitorn/a
Meas. Tech.ChEMBL_1989775 (CHEMBL4623510)
Ki 4.2±n/a nM
Citation Brizzi, AAiello, FBoccella, SCascio, MGDe Petrocellis, LFrosini, MGado, FLigresti, ALuongo, LMarini, PMugnaini, CPessina, FCorelli, FMaione, SManera, CPertwee, RGDi Marzo, V Synthetic bioactive olivetol-related amides: The influence of the phenolic group in cannabinoid receptor activity. Bioorg Med Chem28:0 (2020) 
 
Cannabinoid receptor 2
Name:Cannabinoid receptor 2
Type:G Protein-Coupled Receptor (GPCR)
Mol. Mass.:39690.94
Organism:Homo sapiens (Human)
Description:P34972
Residue:360
BDBM50543739
NameBDBM50543739
Synonyms:CHEMBL4647981
TypeSmall organic molecule
Emp. Form.C27H45NO3
Mol. Mass.431.6511
SMILESCCCCCCC(C)(C)c1cc(OC)cc(OCCCCCCCC(=O)NC2CC2)c1