Reaction Details
TargetSomatostatin receptor type 4
LigandBDBM50100746
Substrate/Competitorn/a
Meas. Tech.ChEMBL_200839 (CHEMBL807049)
IC50 1.3±n/a nM
Citation Rivier, JEHoeger, CErchegyi, JGulyas, JDeBoard, RCraig, AGKoerber, SCWenger, SWaser, BSchaer, JCReubi, JC Potent somatostatin undecapeptide agonists selective for somatostatin receptor 1 (sst1). J Med Chem44:2238-46 (2001) Somatostatin receptor type 4
Name:Somatostatin receptor type 4
Type:Enzyme
Mol. Mass.:42015.38
Organism:Homo sapiens (Human)
Description:P31391
Residue:388
BDBM50100746
NameBDBM50100746
Synonyms:CHEMBL265912 | Des-AA1,2,4,5,12,13-[DTrp8]-SRIF
TypeSmall organic molecule
Emp. Form.C54H66N10O10S2
Mol. Mass.1079.293
SMILESC[C@@H](O)[C@H]1NC(=O)[C@H](CCCCN)NC(=O)[C@@H](Cc2c[nH]c3ccccc23)NC(=O)[C@H](Cc2ccccc2)NC(=O)[C@H](Cc2ccccc2)NC(=O)[C@H](N)CSSC[C@H](NC(=O)[C@H](Cc2ccccc2)NC1=O)C(O)=O