Reaction Details
TargetCollagenase ColA
LigandBDBM50100763
Substrate/Competitorn/a
Meas. Tech.ChEMBL_49485 (CHEMBL659907)
Ki 21±n/a nM
Citation Clare, BWScozzafava, ASupuran, CT Protease inhibitors: synthesis of a series of bacterial collagenase inhibitors of the sulfonyl amino acyl hydroxamate type. J Med Chem44:2253-8 (2001) Collagenase ColA
Name:Collagenase ColA
Type:PROTEIN
Mol. Mass.:125901.02
Organism:Clostridium perfringens
Description:ChEMBL_49485
Residue:1104
BDBM50100763
NameBDBM50100763
Synonyms:CHEMBL304622 | N-Hydroxy-2-[(2-nitro-benzyl)-(2,4,6-trimethyl-benzenesulfonyl)-amino]-propionamide
TypeSmall organic molecule
Emp. Form.C19H23N3O6S
Mol. Mass.421.467
SMILESCC(N(Cc1ccccc1[N+]([O-])=O)S(=O)(=O)c1c(C)cc(C)cc1C)C(=O)NO