Reaction Details
TargetCollagenase ColA
LigandBDBM50100811
Substrate/Competitorn/a
Meas. Tech.ChEMBL_49485 (CHEMBL659907)
Ki 59±n/a nM
Citation Clare, BWScozzafava, ASupuran, CT Protease inhibitors: synthesis of a series of bacterial collagenase inhibitors of the sulfonyl amino acyl hydroxamate type. J Med Chem44:2253-8 (2001) Collagenase ColA
Name:Collagenase ColA
Type:PROTEIN
Mol. Mass.:125901.02
Organism:Clostridium perfringens
Description:ChEMBL_49485
Residue:1104
BDBM50100811
NameBDBM50100811
Synonyms:2-[Benzenesulfonyl-(2-nitro-benzyl)-amino]-N-hydroxy-propionamide | CHEMBL305802
TypeSmall organic molecule
Emp. Form.C16H17N3O6S
Mol. Mass.379.388
SMILESCC(N(Cc1ccccc1[N+]([O-])=O)S(=O)(=O)c1ccccc1)C(=O)NO