Reaction Details
TargetCollagenase ColA
LigandBDBM50100853
Substrate/Competitorn/a
Meas. Tech.ChEMBL_49485 (CHEMBL659907)
Ki 9±n/a nM
Citation Clare, BWScozzafava, ASupuran, CT Protease inhibitors: synthesis of a series of bacterial collagenase inhibitors of the sulfonyl amino acyl hydroxamate type. J Med Chem44:2253-8 (2001) Collagenase ColA
Name:Collagenase ColA
Type:PROTEIN
Mol. Mass.:125901.02
Organism:Clostridium perfringens
Description:ChEMBL_49485
Residue:1104
BDBM50100853
NameBDBM50100853
Synonyms:CHEMBL75940 | {4-[(1-Hydroxycarbamoyl-ethyl)-(2-nitro-benzyl)-sulfamoyl]-phenyl}-carbamic acid tert-butyl ester
TypeSmall organic molecule
Emp. Form.C21H26N4O8S
Mol. Mass.494.518
SMILESCC(N(Cc1ccccc1[N+]([O-])=O)S(=O)(=O)c1ccc(NC(=O)OC(C)(C)C)cc1)C(=O)NO