Reaction Details
TargetCollagenase ColA
LigandBDBM50100855
Substrate/Competitorn/a
Meas. Tech.ChEMBL_49485 (CHEMBL659907)
Ki 10±n/a nM
Citation Clare, BWScozzafava, ASupuran, CT Protease inhibitors: synthesis of a series of bacterial collagenase inhibitors of the sulfonyl amino acyl hydroxamate type. J Med Chem44:2253-8 (2001) Collagenase ColA
Name:Collagenase ColA
Type:PROTEIN
Mol. Mass.:125901.02
Organism:Clostridium perfringens
Description:ChEMBL_49485
Residue:1104
BDBM50100855
NameBDBM50100855
Synonyms:CHEMBL72471 | N-Hydroxy-2-[3-naphthalen-1-yl-1-(2-nitro-benzyl)-ureido]-propionamide
TypeSmall organic molecule
Emp. Form.C21H20N4O5
Mol. Mass.408.4073
SMILESCC(N(Cc1ccccc1[N+]([O-])=O)C(=O)Nc1cccc2ccccc12)C(=O)NO