Reaction Details
Target3-dehydroquinate synthase
LigandBDBM50100861
Substrate/Competitorn/a
Meas. Tech.ChEMBL_351 (CHEMBL615407)
Ki 65000±n/a nM
Citation Chandran, SSFrost, JW Aromatic inhibitors of dehydroquinate synthase: synthesis, evaluation and implications for gallic acid biosynthesis. Bioorg Med Chem Lett11:1493-6 (2001) 3-dehydroquinate synthase
Name:3-dehydroquinate synthase
Type:Enzyme
Mol. Mass.:38878.02
Organism:Escherichia coli (strain K12)
Description:P07639
Residue:362
BDBM50100861
NameBDBM50100861
Synonyms:3,4-Dihydroxybenzoate, VIII 4,5-Dihydroxybenzoic acid CHEMBL37537 Protocatechuic acid (M1) cid_72
TypeSmall organic molecule
Emp. Form.C7H6O4
Mol. Mass.154.1201
SMILESOC(=O)c1ccc(O)c(O)c1